pytest文档16-标记失败xfail

前言

当用例a失败的时候,如果用例b和用例c都是依赖于第一个用例的结果,那可以直接跳过用例b和c的测试,直接给他标记失败xfail 用到的场景,登录是第一个用例,登录之后的操作b是第二个用例,登录之后操作c是第三个用例,很明显三个用例都会走到登录。 如果登录都失败了,那后面2个用例就没测试必要了,直接跳过,并且标记为失败用例,这样可以节省用例时间。

用例设计

1.pytest里面用xfail标记用例为失败的用例,可以直接跳过。实现基本思路

  • 把登录写为前置操作
  • 对登录的账户和密码参数化,参数用canshu = [{“user”:”amdin”, “psw”:”111”}]表示
  • 多个用例放到一个Test_xx的class里
  • test_01,test_02, test_03全部调用fixture里面的login功能
  • test_01测试登录用例
  • test_02和test_03执行前用if判断登录的结果,登录失败就执行,pytest.xfail(“登录不成功, 标记为xfail”)
# content of test_05.py

# coding:utf-8
import pytest

# ** 作者:上海-悠悠 QQ交流群:588402570**

canshu = [{"user":"amdin", "psw":"111"}]

@pytest.fixture(scope="module")
def login(request):
    user = request.param["user"]
    psw = request.param["psw"]
    print("正在操作登录,账号:%s, 密码:%s" % (user, psw))
    if psw:
        return True
    else:
        return False

@pytest.mark.parametrize("login", canshu, indirect=True)
class Test_xx():

    def test_01(self, login):
        '''用例1登录'''
        result = login
        print("用例1:%s" % result)
        assert result == True

    def test_02(self, login):
        result = login
        print("用例3,登录结果:%s" % result)
        if not result:
            pytest.xfail("登录不成功, 标记为xfail")

        assert 1 == 1

    def test_03(self, login):
        result = login
        print("用例3,登录结果:%s" %result)
        if not result:
            pytest.xfail("登录不成功, 标记为xfail")

        assert 1 == 1

if __name__ == "__main__":
    pytest.main(["-s", "test_05.py"])

上面传的登录参数是登录成功的案例,三个用例全部通过

============================= test session starts =============================
platform win32 -- Python 3.6.0, pytest-3.6.3, py-1.5.4, pluggy-0.6.0
rootdir: D:\, inifile:
plugins: metadata-1.7.0, html-1.19.0, allure-adaptor-1.7.10
collected 3 items

..\..\..\..\..\..\YOYO\peizhi\test_05.py 正在操作登录,账号:amdin, 密码:111
用例1:True
.用例3,登录结果:True
.用例3,登录结果:True
.

========================== 3 passed in 0.02 seconds ===========================

标记为xfail

1.再看看登录失败情况的用例,修改登录的参数

# content of test_05.py
# coding:utf-8
import pytest

# ** 作者:上海-悠悠 QQ交流群:588402570**

canshu = [{"user":"amdin", "psw":""}]

@pytest.fixture(scope="module")
def login(request):
    user = request.param["user"]
    psw = request.param["psw"]
    print("正在操作登录,账号:%s, 密码:%s" % (user, psw))
    if psw:
        return True
    else:
        return False

@pytest.mark.parametrize("login", canshu, indirect=True)
class Test_xx():

    def test_01(self, login):
        '''用例1登录'''
        result = login
        print("用例1:%s" % result)
        assert result == True

    def test_02(self, login):
        result = login
        print("用例3,登录结果:%s" % result)
        if not result:
            pytest.xfail("登录不成功, 标记为xfail")

        assert 1 == 1

    def test_03(self, login):
        result = login
        print("用例3,登录结果:%s" %result)
        if not result:
            pytest.xfail("登录不成功, 标记为xfail")

        assert 1 == 1

if __name__ == "__main__":
    pytest.main(["-s", "test_05.py"])

运行结果

============================= test session starts =============================
platform win32 -- Python 3.6.0, pytest-3.6.3, py-1.5.4, pluggy-0.6.0
rootdir: D:\, inifile:
plugins: metadata-1.7.0, html-1.19.0, allure-adaptor-1.7.10
collected 3 items

..\..\..\..\..\..\YOYO\peizhi\test_05.py 正在操作登录,账号:amdin, 密码:
用例1:False
F
self = <YOYO.peizhi.test_05.Test_xx object at 0x00000000045ACF98>, login = False

    def test_01(self, login):
        '''用例1登录'''
        result = login
        print("用例1:%s" % result)
>       assert result == True
E       assert False == True

D:\YOYO\peizhi\test_05.py:24: AssertionError
用例3,登录结果:False
x
Test ignored.用例3,登录结果:False
x
Test ignored.

================================== FAILURES ===================================
___________________________ Test_xx.test_01[login0] ___________________________

self = <YOYO.peizhi.test_05.Test_xx object at 0x00000000045ACF98>, login = False

    def test_01(self, login):
        '''用例1登录'''
        result = login
        print("用例1:%s" % result)
>       assert result == True
E       assert False == True

D:\YOYO\peizhi\test_05.py:24: AssertionError
===================== 1 failed, 2 xfailed in 0.06 seconds =====================

从结果可以看出用例1失败了,用例2和3没执行,直接标记为xfail了 作者:上海-悠悠

原文发布于微信公众号 - 从零开始学自动化测试(yoyoketang)

原文发表时间:2018-08-23

本文参与腾讯云自媒体分享计划,欢迎正在阅读的你也加入,一起分享。

发表于

我来说两句

0 条评论
登录 后参与评论

相关文章

来自专栏雅俗

Linux服务器通过crontab自动备份数据库

执行 crontab 命令如果报 command not found,就表明没有安装

3016
来自专栏开源优测

接口测试 23 requests基础入门二

概述 继续requests基础分享,本文主要分享以下内容: 请求头定制 POST请求 请求头定制示例 在requests中想要为请求添加自定义头信息,只需要简单...

2989
来自专栏python3

linux批量kill进程

ps -ef|grep orderMatcherSend.php |grep -v grep|cut -c 9-15|xargs kill -9

992
来自专栏PHP实战技术

你应该这个姿势学习PHP(4)

1、fopen() fwrite() fclose() fiel_put_contents

54515
来自专栏码洞

自己动手实现 Shell多进程套套符

一篇技术文章如今仅仅是理论上讲得天花乱坠,却不能自己撸出东西来,那么它写的再好,也只能算纸上谈兵。继上一篇 《我们天天都在使用的套套符命令,Shell 在里面到...

1081
来自专栏Android随笔

mac学习笔记

在打开的文本文件中,添加如下内容(/XXX/XXX/platform-tools/为你的adb路径)

822
来自专栏锦小年的博客

python学习笔记5.4-包的发布

有时候我们创建了一个非常好用的包,希望能够分发给好友一起使用,或者开源到网上,这个时候就要会利用python包的发布的工具。 一个健壮的包,并不只是包含有代...

19610
来自专栏自由而无用的灵魂的碎碎念

解决source insight 3.5遇到的parse too comples错误

我使用source insight 编写c,编写代码的时候,source insight的symbol windows可能会提示parse too comple...

1272
来自专栏张伟博客

双系统下Linux(ubuntu)不能进入windows的NTFS分区之挂载错误问题解决

1805
来自专栏chafezhou

小说python的路径操作

1562

扫码关注云+社区

领取腾讯云代金券