pytest文档2-用例运行规则

用例设计原则

  • 文件名以test_*.py文件和*_test.py
  • 以test_开头的函数
  • 以Test开头的类
  • 以test_开头的方法
  • 所有的包pakege必须要有__init__.py文件

help帮助

1.查看pytest命令行参数,可以用pytest -h 或pytest —help查看

C:\Users\admin>pytest -h
usage: pytest [options] [file_or_dir] [file_or_dir] [...]

positional arguments:
  file_or_dir

general:
  -k EXPRESSION         only run tests which match the given substring
                        expression. An expression is a python evaluatable
                        expression where all names are substring-matched
                        against test names and their parent classes. Example:
                        -k 'test_method or test_other' matches all test
                        functions and classes whose name contains
                        'test_method' or 'test_other', while -k 'not
                        test_method' matches those that don't contain
                        'test_method' in their names. Additionally keywords
                        are matched to classes and functions containing extra
                        names in their 'extra_keyword_matches' set, as well as
                        functions which have names assigned directly to them.
  -m MARKEXPR           only run tests matching given mark expression.
                        example: -m 'mark1 and not mark2'.
  --markers             show markers (builtin, plugin and per-project ones).
  -x, --exitfirst       exit instantly on first error or failed test

reporting:
  -v, --verbose         increase verbosity.
  -q, --quiet           decrease verbosity.
  --verbosity=VERBOSE   set verbosity

只贴了一部分

按以下目录写用例

D:YOYO\
    __init__.py

    test_class.py
        #  content of  test_class.py  
        class TestClass:
            def test_one(self):
                x = "this"
                assert 'h' in x

            def test_two(self):
                x = "hello"
                assert hasattr(x, 'check')

            def test_three(self):
                a = "hello"
                b = "hello world"
                assert a in b

    test_sample.py
        #  content of  test_sample.py
        def func(x):
            return x +1

        def test_answer():
            assert func(3)==5

python -m

cmd执行pytest用例有三种方法,以下三种方法都可以,一般推荐第一个

  • pytest
  • py.test
  • python -m pytest

如果不带参数,在某个文件夹下执行时,它会查找该文件夹下所有的符合条件的用例(查看用例设计原则)

执行用例规则

1.执行某个目录下所有的用例

pytest 文件名/

2.执行某一个py文件下用例

pytest 脚本名称.py

3.-k 按关键字匹配

pytest -k “MyClass and not method”

这将运行包含与给定字符串表达式匹配的名称的测试,其中包括Python 使用文件名,类名和函数名作为变量的运算符。 上面的例子将运行 TestMyClass.test_something但不运行TestMyClass.test_method_simple

4.按节点运行

每个收集的测试都分配了一个唯一的nodeid,它由模块文件名和后跟说明符组成 来自参数化的类名,函数名和参数,由:: characters分隔。

运行.py模块里面的某个函数

pytest test_mod.py::test_func

运行.py模块里面,测试类里面的某个方法

pytest test_mod.py::TestClass::test_method

5.标记表达式

pytest -m slow

将运行用@ pytest.mark.slow装饰器修饰的所有测试。

6.从包里面运行

pytest —pyargs pkg.testing

这将导入pkg.testing并使用其文件系统位置来查找和运行测试。

-x 遇到错误时停止测试

pytest -x test_class.py

从运行结果可以看出,本来有3个用例,第二个用例失败后就没继续往下执行了

D:\YOYO>pytest -x test_class.py
============================= test session starts =============================
platform win32 -- Python 3.6.0, pytest-3.6.3, py-1.5.4, pluggy-0.6.0
rootdir: D:\YOYO, inifile:
collected 3 items

test_class.py .F

================================== FAILURES ===================================
_____________________________ TestClass.test_two ______________________________

self = <YOYO.test_class.TestClass object at 0x0000000003A29780>

    def test_two(self):
        x = "hello"
>       assert hasattr(x, 'check')
E       AssertionError: assert False
E        +  where False = hasattr('hello', 'check')

test_class.py:11: AssertionError
===================== 1 failed, 1 passed in 0.05 seconds ======================

—maxfail=num

pytest —maxfail=1

当用例错误个数达到指定数量时,停止测试

D:\YOYO>pytest --maxfail=1
============================= test session starts =============================
platform win32 -- Python 3.6.0, pytest-3.6.3, py-1.5.4, pluggy-0.6.0
rootdir: D:\YOYO, inifile:
collected 4 items

test_class.py .F

================================== FAILURES ===================================
_____________________________ TestClass.test_two ______________________________

self = <YOYO.test_class.TestClass object at 0x0000000003A3D080>

    def test_two(self):
        x = "hello"
>       assert hasattr(x, 'check')
E       AssertionError: assert False
E        +  where False = hasattr('hello', 'check')

test_class.py:11: AssertionError
===================== 1 failed, 1 passed in 0.06 seconds ======================

原文发布于微信公众号 - 从零开始学自动化测试(yoyoketang)

原文发表时间:2018-07-25

本文参与腾讯云自媒体分享计划,欢迎正在阅读的你也加入,一起分享。

发表于

我来说两句

0 条评论
登录 后参与评论

相关文章

来自专栏JavaQ

Java多线程编程笔记之Condition

本篇内容基于JDK7,涉及Condition常用方法。 1.概述 Condition接口位于java.util.concurrent.locks包下,实现类有 ...

2755
来自专栏杂七杂八

列表、字典、集合中筛选数据

传统迭代法 data = [1,5,-3,-2,8,0,9] res = [] for x in data: if x >=0: res...

3776
来自专栏博客园

Asp.Net Web API(三)

    在Asp.Net Web API中,一个控制器就是一个处理HTTP请求的类,控制器的public方法就被叫做action方法或简单的Action。当We...

1575
来自专栏linux、Python学习

十分钟带你了解 Python3 多线程核心知识

每个独立的线程有一个程序运行的入口、顺序执行序列和程序的出口。但是线程不能够独立执行,必须依存在应用程序中,由应用程序提供多个线程执行控制。

2090
来自专栏向治洪

命令模式

命令模式定义 将一个请求封装为一个对象,从而使你可用不同的请求对客户进行参数化;对请求排队或记录请求日志,以及支持可撤销的操作。 作用 命令模式主要应用于将行...

1989
来自专栏python3

python if else 流程判断

Python条件语句是通过一条或多条语句的执行结果(True或者False)来决定执行的代码块。 可以通过下图来简单了解条件语句的执行过程:

1782
来自专栏日常工作总结

ASP.NET MVC中使用AJAX传参技巧

    一般情况下进行GET请求才会这么做,类似在浏览器的地址栏敲进去的url地址那样,客户端的js代码如下,这里对服务器端做了一个请求(这里用GET),请求通...

1562
来自专栏noteless

javaweb请求编码 url编码 响应编码 乱码问题 post编码 get请求编码 中文乱码问题 GET POST参数乱码问题 url乱码问题 get post请求乱码 字符编码

然后使用      65------>$ 另外一种解码方式解读,显然A就变成了$,这不就是乱码了么

1783
来自专栏性能与架构

Zookeeper实例 - 分布式锁

需求场景 在分布式系统中,通常会有多个子系统需要操作同一资源,例如修改数据存储中的某一数据 这些子系统各自独立,操作共享资源时没有逻辑顺序,有可能会出现同时...

3685
来自专栏C#

C#创建安全的栈(Stack)存储结构

    在C#中,用于存储的结构较多,如:DataTable,DataSet,List,Dictionary,Stack等结构,各种结构采用的存储的方式存在...

2146

扫码关注云+社区

领取腾讯云代金券