展开

关键词

首页关键词gcc no such file or directory

gcc no such file or directory

相关内容

文件存储

文件存储

安全可靠、集成化、容量可扩展的低成本共享文件存储服务
  • gcc g ++中出现错误 “No such file or directory”应该怎么解决?

    g++ 给我错误的形式: foo.cc::: fatal error: : No such file or directorycompilation terminated.
    来自:
    回答:1
  • fatal error: Python.h: No such file or directory

    我正在尝试使用C扩展文件构建共享库,但首先必须使用以下命令生成输出文件: gcc -Wall utilsmodule.c -o Utilc 执行该命令后,我收到以下错误消息: utilsmodule.c:1:20: fatal error: Python.h: No such file or directory compilation terminated.
    来自:
    回答:2
  • OSError: No such file or directory

    AppleWebKit537.36 (KHTML, like Gecko) Chrome40.0.2214.93 Safari537.36})    Traceback (most recent call last):      Filerootdzqworkspacetoolsglusterfs-restglusterrestrestapi.py, line 214, in get        self.write(volume_df(vol))      Filerootdzqworkspacetoolsglusterfs-restglusterrestclivolume.py, line 399, in df        utils.checkstatuszero(cmd1)      Filerootdzqworkspacetoolsglusterfs-restglusterrestutils.py, line 21, in execute        close_fds=close_fds)      File, line 1234, in _execute_child        raise child_exception    OSError: No such file or directory解决方案
    来自:
    浏览:523
  • 广告
    关闭

    50+款云产品免费体验

    提供包括云服务器,云数据库在内的50+款云计算产品。打造一站式的云产品试用服务,助力开发者和企业零门槛上云。

  • Cannot make file java.io.IOException: No such file or directory

    我试图在文件系统上创建一个文件,但是我一直得到这样的异常: java.io.IOException: No such file or directory 我有一个现有的目录,我正在尝试将一个文件写入该目录I have also tried this below, but get same error new File(System.getProperty(user.home) + .foobar + fileName); File f = new File(System.getProperty(user.home) + .foobar, fileName); if (f.exists() && !or directory at java.io.UnixFileSystem.createFileExclusively(Native Method) at java.io.File.createNewFile(File.java:883)` 我对路径有写权限,但是文件没有创建。
    来自:
    回答:2
  • Azure Active Directory 单点登录腾讯云指南

    操作场景Azure Active Directory (Azure AD) 是 Microsoft 推出的基于云的标识和访问管理服务,可帮助员工管理内外部资源。进入 Azure AD 门户页,单击左侧导航栏中【Azure Active Directory】。如下图所示:单击【企业应用程序】,选择【所有应用程序】。单击左侧导航栏【Azure Active Directory】,单击【用户】,打开【所有用户】。在左侧导航栏中,选择【Azure Active Directory】>【企业应用程序】> 您创建的应用程序,进入应用程序概览页面,并单击【用户和组】。如下图所示:在左侧导航栏中,选择【Azure Active Directory】>【企业应用程序】> 您创建的应用程序 ,进入应用程序概览页面。
    来自:
  • Web 应用防火墙

    支持地域,WAF 结合 API 网关提供安全防护,Apache SkyWalking SQL 注入漏洞安全风险公告(CVE-2020-13921),Jenkins 发布9月安全更新公告,WordPress File结合 API 网关提供安全防护,安全公告,Apache SkyWalking SQL 注入漏洞安全风险公告(CVE-2020-13921),Jenkins 发布9月安全更新公告,WordPress File
    来自:
  • 访问管理

    从用户组删除用户,查询用户组关联的用户列表,拉取子用户,列出用户关联的用户组,查询用户组列表,查询子用户,查询用户组详情,删除子用户,删除用户组,用户加入到用户组,添加子用户,Azure Active Directory从用户组删除用户,查询用户组关联的用户列表,拉取子用户,列出用户关联的用户组,查询用户组列表,查询子用户,查询用户组详情,删除子用户,删除用户组,用户加入到用户组,添加子用户,Azure Active Directory
    来自:
  • 【node错误】usrbinenv: node: No such file or directory

    背景安装了node后,执行npm run xxx的命令的时候,报错,提示如下:usrbinenv: node: No such file or directory步骤1.
    来自:
    浏览:8542
  • gcc命令

    在Linux底下搞开发,不可避免的要使用到gcc,gcc选项众多,下面记录下常见的一些选项,网上好多博客也说这个但是很多的都是不对的,我的博客记录参见man gcc,应该还是比较准的常用的选项: gccIf the directory dir is a standard system include directory, the option is ignored to ensure that the-o(输出)输出结果,不写的话系统默认名为a.outPlace output in file file.file, an assembler file or preprocessed C code.比如: 将hello.c文件编译生成的结果命名为helloApp,可以这样 gcc hello.c -oso) -Ldir搜索动态连接库,使用-L和-l -L Add directory dir to the list of directories to be searched for -l.
    来自:
    浏览:291
  • npm WARN saveError ENOENT: no such file or directory解决

    安装完成node.js后使用npm安装vue报错如下:C:Userslxz>npm uninstall vueWcsp npm WARN saveError ENOENT: no such file ordirectory, open C:Userslxzpackage.json npm WARN enoent ENOENT: no such file or directory, open C:Userslxzpackage.json
    来自:
    浏览:1041
  • libmysqlclient.so.16: cannot open shared object file: No such file or directory

    编译安装的mysql5.6.39,安装目录是usrlocalmysql,启用程序时报错:libmysqlclient.so.16: cannot open shared object file: Nosuch file or directory。: etcld.so.conf.dkernel-2.6.32-696.el6.x86_64.conf:6: duplicate hwcap 1 nosegnegldconfig: Cant open directory: etcld.so.conf.dkernel-2.6.32-696.el6.x86_64.conf:6: duplicate hwcap 1 nosegnegldconfig: Cant open directory: etcld.so.conf.dkernel-2.6.32-696.el6.x86_64.conf:6: duplicate hwcap 1 nosegnegldconfig: Cant open directory
    来自:
    浏览:1475
  • 我killed RVM出现bash错误:No such file or directory?

    当我在OSX终端上运行cd时,我收到这样的消息: ~projects $ cd-bash: Usersboris.rvmscriptsinitialize: No such file or directory-bash: Usersboris.rvmscriptshook: No such file or directory
    来自:
    回答:2
  • Web For Pentester - Directory traversal & File Include Part Tips

    Directory traversal PartExample 1最基础的目录穿越造成的任意文件读取,这里为相对路径,通过“..”可进行目录跳转file=................etcpasswdExample2路径显示为网站物理路径,直接改为etcpasswd不成功,通过..进行目录穿越file=varwwwfiles......etcpasswdExample 3这里可以看出文件名后缀被写死到了程序当中,使用%00进行截断file=..................etcpasswd%00File Include PartExample 1使用单引号报错可以看到程序抛出了异常,这里爆出了网站物理路径当然可以使用目录穿越去包含本地etcpasswd文件,也可以使用远程文件包含去getshellpage=................etcpasswdpage=http:vps地址phpinfo.txtExample 2与Directory
    来自:
    浏览:458
  • Sublime No such file or directory: node怎么办?

    No such file or directory: node] Additional Information Node version :v0.10.13which node: usrlocalbinnodeecho
    来自:
    回答:2
  • pthread_rwlock_rdlock和“No such file or directory”

    pthread_rwlock_rdlock和“No such file or directory” 调用pthread_rwlock_rdlock时,如果失败报错“pthread_rwlock_rdlock
    来自:
    浏览:138
  • 安装python-snappy时出错:snappy-c.h: No such file or directory这个错误怎么解决?

    我发现了一个错误: running build running build_ext building snappy extension gcc -pthread -fno-strict-aliasingWstrict-prototypes’ is valid for AdaCObjC but not for C++ snappymodule.cc:31:22: fatal error: snappy-c.h: No such fileor directory compilation terminated. error: command gcc failed with exit status 1 我怎么才能摆脱这个错误呢?
    来自:
    回答:2
  • srclxmletree_defs.h:09:31:atal error: libxmlxmlversion.h: No such file or directory,怎么解决?

    libxml2 and libxslt are installed ** Using build configuration of libxslt building lxml.etree extension gccor directory compilation terminated. error: command gcc failed with exit status 1 Complete output fromcommand usrbinpython -c import setuptools;__file__=rootProjectsirbuildlxmlsetup.py;execfile(__file__2.7lxmlisoschematronresourcesxsliso-schematron-xslt1 running build_ext building lxml.etree extension gccor directory compilation terminated. error: command gcc failed with exit status 1 ------------------
    来自:
    回答:2
  • 解决报错libssl.so.1.1: cannot open shared object file: No such file or directory

    Centos7默认提供的openssl版本是1.0.2的,某些php扩展或者其他软件依赖1.1以上版本如果过低的话就会报错libssl.so.1.1: cannot open shared object file: No such file or directory也有执行openssl version时报错和上面一致,这是由于openssl库的位置不正确或未安装1.1以上版本的问题想要升级openssl版本则需要手动进行编译任何个人或团体,未经允许禁止转载本文:《解决报错libssl.so.1.1: cannot open shared object file: No such file or directory》,谢谢合作
    来自:
    浏览:5365
  • linux中运行zipalignaapt提示:No such file or directory解决办法

    最近在用Docker+Jenkins做持续集成(CI),中间有个步骤需要调用zipalign对齐jar包,但我运行zipalign的时候却提示: No such file or directory。后来我搜索“Linux no such file or directory原因” 找到: Linux执行可执行文件提示No such file or directory的解决方法 原来是库不匹配的原因。再搜索“Linux zipalign no such file or directory” 找到: sudo apt-get install libc6:i386 libstdc++6:i386 zlib1g: No such file or directory 继续google,找到: sudo apt-get install lib32z1 安装,解决。所以zipalign:No such file or directory的原因是找不到匹配的32位库。 提示这个错误可能是二进制文件错误处理信息不够完善。
    来自:
    浏览:842

扫码关注云+社区

领取腾讯云代金券